BDBM50596676 CHEMBL5203375
SMILES Nc1nc2NC(=O)CC(c3cccc(OC(F)(F)F)c3)c2c(=O)[nH]1
InChI Key InChIKey=OFAJQDZKLHAKGN-UHFFFAOYSA-N
Data  1 IC50
  Tab Delimited (TSV)   2D SDfile   Computed 3D by Vconf -m prep SDfile
Find this compound or compounds like it in BindingDB:
Activity Spreadsheet -- Enzyme Inhibition Constant Data from BindingDB
Found 1 hit for monomerid = 50596676
TargetPituitary adenylate cyclase-activating polypeptide type I receptor(Homo sapiens (Human))
University Of Toyama
Curated by ChEMBL
LigandPNGBDBM50596676(CHEMBL5203375)
Affinity DataIC50:  0.110nM. Assay description: Antagonist activity at PAC-1 receptor (unknown origin) expressed in CHO cells assessed as inhibition of PACAP-induced increase in intracellular cAMP ...
Ligand InfoPC cidPC sid
In DepthDetails PubMed