BDBM50596978 CHEMBL5171912
SMILES COCCN1CCN(CC1)C(=O)CNC1CC1c1cc(F)cc(F)c1OCc1cnn(C)c1
InChI Key InChIKey=GSHIDCKRCXBVJN-UHFFFAOYSA-N
Data  1 KI  1 IC50
  Tab Delimited (TSV)   2D SDfile   Computed 3D by Vconf -m prep SDfile
Find this compound or compounds like it in BindingDB:
Activity Spreadsheet -- Enzyme Inhibition Constant Data from BindingDB
Found 2 hits for monomerid = 50596978
TargetLysine-specific histone demethylase 1A(Homo sapiens (Human))
Riken Center For Sustainable Resource Science
Curated by ChEMBL
LigandPNGBDBM50596978(CHEMBL5171912)
Affinity DataKi:  6.00E+3nM. Assay description: Inhibition of human LSD1 assessed as inhibitory constant using Histone H3(1-20)K4me2 peptide as substrate incubated for 10 mins followed by substrate...
Ligand InfoPC cidPC sid
In DepthDetails PubMed
TargetLysine-specific histone demethylase 1A(Homo sapiens (Human))
Riken Center For Sustainable Resource Science
Curated by ChEMBL
LigandPNGBDBM50596978(CHEMBL5171912)
Affinity DataIC50:  2.10E+4nM. Assay description: Inhibition of human LSD1 assessed as demethylase activity of LSD1 using Histone H3(1-20)K4me2 peptide as substrate incubated for 10 mins followed by ...
Ligand InfoPC cidPC sid
In DepthDetails PubMed