BDBM50597545 CHEMBL5171748
SMILES Cc1cc(Br)c(F)cc1[C@H]1C[C@@H]1N
InChI Key InChIKey=PTHUNDRPMGKZPH-XCBNKYQSSA-N
Data  2 KI
  Tab Delimited (TSV)   2D SDfile   Computed 3D by Vconf -m prep SDfile
Find this compound or compounds like it in BindingDB:
Activity Spreadsheet -- Enzyme Inhibition Constant Data from BindingDB
Found 2 hits for monomerid = 50597545
TargetLysine-specific histone demethylase 1A(Homo sapiens (Human))
Riken Center For Biosystems Dynamics Research
Curated by ChEMBL
LigandPNGBDBM50597545(CHEMBL5171748)
Affinity DataKi:  320nM. Assay description: Inhibition of LSD1 (unknown origin) (172 to 833 residues) expressed in baculovirus-infected Sf9 insect cells using K4-dimethylated H3 as substrate by...
Ligand InfoPC cidPC sid
In DepthDetails PubMed
TargetLysine-specific histone demethylase 2(Homo sapiens (Human))
Riken Center For Biosystems Dynamics Research
Curated by ChEMBL
LigandPNGBDBM50597545(CHEMBL5171748)
Affinity DataKi:  2.80E+5nM. Assay description: Inhibition of LSD2 (unknown origin) (26 to 822 residues) expressed in baculovirus-infected Sf9 insect cells using K4-dimethylated H3 as substrate by ...
Ligand InfoPC cidPC sid
In DepthDetails PubMed