BDBM50598017 CHEMBL5206272
SMILES COC(=O)c1cc(O)c2cc(NC(=O)NCCCCCNC(=N)NC[C@H]3O[C@H]([C@H](O)[C@@H]3O)n3cnc4c(N)ncnc34)ccc2c1
InChI Key InChIKey=UBOFQOGNZXZZPE-HUBRGWSESA-N
Data  7 IC50  1 Kd
PDB links: 2 PDB IDs match this monomer.
  Tab Delimited (TSV)   2D SDfile   Computed 3D by Vconf -m prep SDfile
Find this compound or compounds like it in BindingDB:
Activity Spreadsheet -- Enzyme Inhibition Constant Data from BindingDB
Found 8 hits for monomerid = 50598017
TargetProtein arginine N-methyltransferase 1(Homo sapiens)
Institut De G£N£Tique Et De Biologie Mol£Culaire Et Cellulaire
Curated by ChEMBL
LigandPNGBDBM50598017(CHEMBL5206272)
Affinity DataIC50:  8.46E+3nM. Assay description: Inhibition of human full length recombinant GST-tagged PRMT1 (2 to 371 residues) using histone H4 as substrate incubated for 20 mins in presence of [...
Ligand InfoPC cidPC sidPDB
In DepthDetails PubMed
TargetProtein arginine N-methyltransferase 3(Homo sapiens)
Institut De G£N£Tique Et De Biologie Mol£Culaire Et Cellulaire
Curated by ChEMBL
LigandPNGBDBM50598017(CHEMBL5206272)
Affinity DataIC50:  2.13E+4nM. Assay description: Inhibition of human full length recombinant GST his-tagged PRMT3 (2 to 531 residues) using histone H4 as substrate incubated for 20 mins in presence ...
Ligand InfoPC cidPC sidPDB
In DepthDetails PubMed
TargetHistone-arginine methyltransferase CARM1(Homo sapiens (Human))
Institut De G£N£Tique Et De Biologie Mol£Culaire Et Cellulaire
Curated by ChEMBL
LigandPNGBDBM50598017(CHEMBL5206272)
Affinity DataIC50:  420nM. Assay description: Inhibition of human full length recombinant GST-tagged PRMT4 (2 to 608 residues) using histone H3 as substrate incubated for 20 mins in presence of [...
Ligand InfoPC cidPC sidPDB
TargetHistone-arginine methyltransferase CARM1(Homo sapiens (Human))
Institut De G£N£Tique Et De Biologie Mol£Culaire Et Cellulaire
Curated by ChEMBL
LigandPNGBDBM50598017(CHEMBL5206272)
Affinity DataKd:  359nM. Assay description: Binding affinity to full length recombinant PRMT4 (unknown origin) assessed as dissociation constant by surface plasmon resonance
Ligand InfoPC cidPC sidPDB
TargetProtein arginine N-methyltransferase 6(Homo sapiens (Human))
Institut De G£N£Tique Et De Biologie Mol£Culaire Et Cellulaire
Curated by ChEMBL
LigandPNGBDBM50598017(CHEMBL5206272)
Affinity DataIC50: >1.00E+5nM. Assay description: Inhibition of human full length recombinant GST-tagged PRMT6 (2 to 375 residues) using GST-GAR as substrate incubated for 20 mins in presence of [3H]...
Ligand InfoPC cidPC sidPDB
TargetProtein arginine N-methyltransferase 7(Homo sapiens (Human))
Institut De G£N£Tique Et De Biologie Mol£Culaire Et Cellulaire
Curated by ChEMBL
LigandPNGBDBM50598017(CHEMBL5206272)
Affinity DataIC50:  220nM. Assay description: Inhibition of human full length recombinant his-tagged PRMT7 (2 to 692 residues) using GST-GAR as substrate incubated for 20 mins in presence of [3H]...
Ligand InfoPC cidPC sidPDB
In DepthDetails PubMed
TargetProtein arginine N-methyltransferase 8(Homo sapiens (Human))
Institut De G£N£Tique Et De Biologie Mol£Culaire Et Cellulaire
Curated by ChEMBL
LigandPNGBDBM50598017(CHEMBL5206272)
Affinity DataIC50:  5.87E+3nM. Assay description: Inhibition of human full length recombinant his-tagged PRMT8 (61 to 394 residues) using histone H4 as substrate incubated for 20 mins in presence of ...
Ligand InfoPC cidPC sidPDB
In DepthDetails PubMed
TargetProtein arginine N-methyltransferase 5(Homo sapiens (Human))
Institut De G£N£Tique Et De Biologie Mol£Culaire Et Cellulaire
Curated by ChEMBL
LigandPNGBDBM50598017(CHEMBL5206272)
Affinity DataIC50:  5.14E+4nM. Assay description: Inhibition of human full length recombinant FLAG-tagged PRMT5 (2 to 637 residues) using histone H2A as substrate incubated for 20 mins in presence of...
Ligand InfoPC cidPC sidPDB
In DepthDetails PubMed