BDBM50598408 CHEMBL5180920
SMILES COc1ccccc1C(C#N)c1nc(SC(C)C)[nH]c(=O)c1C
InChI Key InChIKey=CXDAPOCVEZSGLL-UHFFFAOYSA-N
Data  1 IC50
  Tab Delimited (TSV)   2D SDfile   Computed 3D by Vconf -m prep SDfile
Find this compound or compounds like it in BindingDB:
Activity Spreadsheet -- Enzyme Inhibition Constant Data from BindingDB
Found 1 hit for monomerid = 50598408
TargetReverse transcriptase/RNaseH(Human immunodeficiency virus 1)
Sichuan University
Curated by ChEMBL
LigandPNGBDBM50598408(CHEMBL5180920)
Affinity DataIC50:  158nM. Assay description: Inhibition of recombinant wild-type p66/p51 HIV-1 reverse transcriptase incubated for 40 mins by picogreen dye-based spectrofluorometric analysis
Ligand InfoPC cidPC sid
In DepthDetails PubMed