BDBM50598619 CHEMBL5199008
SMILES CCOc1ncc2cc(C3=CC4N=C(CCN5CCC(O)C5)N(C)C4C=C3)c(=O)n(-c3ccc(OC(F)F)cc3)c2n1
InChI Key InChIKey=VMZVSXXQNKSCRU-UHFFFAOYSA-N
Data  1 IC50
  Tab Delimited (TSV)   2D SDfile   Computed 3D by Vconf -m prep SDfile
Find this compound or compounds like it in BindingDB:
Activity Spreadsheet -- Enzyme Inhibition Constant Data from BindingDB
Found 1 hit for monomerid = 50598619
TargetS-adenosylmethionine synthase isoform type-2(Human)
China Pharmaceutical University
Curated by ChEMBL
LigandPNGBDBM50598619(CHEMBL5199008)
Affinity DataIC50:  4.70nM. Assay description: Inhibition of MAT2A (unknown origin) assessed as S-adenosyl methionine production using L-methionine as substrate pretreated for 60 mins followed by ...
Ligand InfoPC cidPC sid
In DepthDetails PubMed