BDBM50598935 CHEMBL5194650
SMILES Nc1nnc(cc1-c1ccccc1)-c1ccccc1
InChI Key InChIKey=GKXZFBBRPQIVHB-UHFFFAOYSA-N
Data  2 IC50  4 Kd
  Tab Delimited (TSV)   2D SDfile   Computed 3D by Vconf -m prep SDfile
Find this compound or compounds like it in BindingDB:
Activity Spreadsheet -- Enzyme Inhibition Constant Data from BindingDB
Found 6 hits for monomerid = 50598935
TargetTranscription activator BRG1(Homo sapiens (Human))
Constellation, A Morphosys
Curated by ChEMBL
LigandPNGBDBM50598935(CHEMBL5194650)
Affinity DataIC50:  5.71E+4nM. Assay description: Inhibition of His-tagged SMARCA4 (unknown origin) (1448 to 1575 residues) using biotinylated ARTKQTARKSTGG-K(Ac)-APR-K(Ac)-QLAT-K(Ac)-AAR-K(Ac)-SAPGG...
Ligand InfoPC cidPC sid
In DepthDetails PubMed
TargetBromodomain-containing protein 4(Homo sapiens (Human))
Constellation, A Morphosys
Curated by ChEMBL
LigandPNGBDBM50598935(CHEMBL5194650)
Affinity DataIC50: >1.00E+5nM. Assay description: Inhibition of BRD4 bromodomain 1 (unknown origin) by TR-FRET assay
Ligand InfoPC cidPC sid
In DepthDetails PubMed
TargetProtein polybromo-1(Homo sapiens (Human))
Constellation, A Morphosys
Curated by ChEMBL
LigandPNGBDBM50598935(CHEMBL5194650)
Affinity DataKd:  5.70E+3nM. Assay description: Binding affinity to human PBRM1 bromodomain 2 (S178 to E291 residues) expressed in bacterial expression system by bromoscan assay
Ligand InfoPC cidPC sid
In DepthDetails PubMed
TargetProbable global transcription activator SNF2L2(Homo sapiens (Human))
Constellation, A Morphosys
Curated by ChEMBL
LigandPNGBDBM50598935(CHEMBL5194650)
Affinity DataKd:  4.40E+3nM. Assay description: Binding affinity to human SMARCA2 (S1337 to Q1486 residues) expressed in bacterial expression system by bromoscan assay
Ligand InfoPC cidPC sid
In DepthDetails PubMed
TargetProtein polybromo-1(Homo sapiens (Human))
Constellation, A Morphosys
Curated by ChEMBL
LigandPNGBDBM50598935(CHEMBL5194650)
Affinity DataKd:  2.70E+4nM. Assay description: Binding affinity to human PBRM1 bromodomain 5 (S645 to D766 residues) expressed in bacterial expression system by bromoscan assay
Ligand InfoPC cidPC sid
In DepthDetails PubMed
TargetTranscription activator BRG1(Homo sapiens (Human))
Constellation, A Morphosys
Curated by ChEMBL
LigandPNGBDBM50598935(CHEMBL5194650)
Affinity DataKd:  1.00E+4nM. Assay description: Binding affinity to human SMARCA4 (A1448 to S1575 residues) expressed in bacterial expression system by bromoscan assay
Ligand InfoPC cidPC sid
In DepthDetails PubMed