BDBM50600805 CHEMBL5178786
SMILES COCCO[C@H]1CC[C@@H](CC1)NC(=O)c1cc(cc2c(c[nH]c12)[N+]([O-])=O)-n1ccnc1
InChI Key InChIKey=RMKXQQQRGZKXEK-KOMQPUFPSA-N
Data  1 IC50
  Tab Delimited (TSV)   2D SDfile   Computed 3D by Vconf -m prep SDfile
Find this compound or compounds like it in BindingDB:
Activity Spreadsheet -- Enzyme Inhibition Constant Data from BindingDB
Found 1 hit for monomerid = 50600805
TargetADP-ribosyl cyclase/cyclic ADP-ribose hydrolase 1(Homo sapiens (Human))
Mitobridge (An Astellas)
Curated by ChEMBL
LigandPNGBDBM50600805(CHEMBL5178786)
Affinity DataIC50:  4nM. Assay description: Inhibition of human his tagged CD38 using N6-etheno-NAD as substrate by fluorescence microplate reader assay
Ligand InfoPC cidPC sid
In DepthDetails PubMed