BDBM50601900 CHEMBL5192614
SMILES CC[C@H](C)[C@H](NC(C)=O)C(=O)N[C@@H]([C@@H](C)O)C(=O)NCC(=O)N[C@@H](C)B(O)O
InChI Key InChIKey=CDHRYSGPPLGRGH-BTXSVYSASA-N
Data  1 IC50
  Tab Delimited (TSV)   2D SDfile   Computed 3D by Vconf -m prep SDfile
Find this compound or compounds like it in BindingDB:
Activity Spreadsheet -- Enzyme Inhibition Constant Data from BindingDB
Found 1 hit for monomerid = 50601900
TargetSubtilisin-like protease 1(Plasmodium falciparum)
Latvian Institute Of Organic Synthesis
Curated by ChEMBL
LigandPNGBDBM50601900(CHEMBL5192614)
Affinity DataIC50:  69nM. Assay description: Inhibition of Plasmodium falciparum SUB1
Ligand InfoPC cidPC sid
In DepthDetails PubMed