BDBM50601903 CHEMBL5194400
SMILES C[C@H](NC(=O)CNC(=O)[C@H](C)NC(=O)[C@@H](NC(C)=O)C1CCCC1)B(O)O
InChI Key InChIKey=UQIQXNAAUDYREJ-BHDSKKPTSA-N
Data  1 IC50
  Tab Delimited (TSV)   2D SDfile   Computed 3D by Vconf -m prep SDfile
Find this compound or compounds like it in BindingDB:
Activity Spreadsheet -- Enzyme Inhibition Constant Data from BindingDB
Found 1 hit for monomerid = 50601903
TargetSubtilisin-like protease 1(Plasmodium falciparum)
Latvian Institute Of Organic Synthesis
Curated by ChEMBL
LigandPNGBDBM50601903(CHEMBL5194400)
Affinity DataIC50:  7.80E+3nM. Assay description: Inhibition of Plasmodium falciparum SUB1
Ligand InfoPC cidPC sid
In DepthDetails PubMed