BDBM50601906 CHEMBL5204305
SMILES CC(C)[C@H](NC(=O)Cc1ccccc1)C(=O)NCC(=O)N[C@@H](C)C(=O)C(F)(F)C(=O)NCC(O)=O
InChI Key InChIKey=GNKYPFZGPQNMGU-UGSOOPFHSA-N
Data  1 IC50
  Tab Delimited (TSV)   2D SDfile   Computed 3D by Vconf -m prep SDfile
Find this compound or compounds like it in BindingDB:
Activity Spreadsheet -- Enzyme Inhibition Constant Data from BindingDB
Found 1 hit for monomerid = 50601906
TargetSubtilisin-like protease 1(Plasmodium falciparum)
Latvian Institute Of Organic Synthesis
Curated by ChEMBL
LigandPNGBDBM50601906(CHEMBL5204305)
Affinity DataIC50:  1.00E+3nM. Assay description: Inhibition of recombinant Plasmodium falciparum SUB1 using SERA4st1F-6R1 as substrate by fluorescence spectrophotometer
Ligand InfoPC cidPC sid
In DepthDetails PubMed