BDBM50602160 CHEMBL5179994
SMILES OC[C@@H]1Cc2ccc(Cl)cc2[C@@H](N1)c1cccc(F)c1
InChI Key InChIKey=HKPNVLQWPJGTBI-HOCLYGCPSA-N
Data  2 EC50
  Tab Delimited (TSV)   2D SDfile   Computed 3D by Vconf -m prep SDfile
Find this compound or compounds like it in BindingDB:
Activity Spreadsheet -- Enzyme Inhibition Constant Data from BindingDB
Found 2 hits for monomerid = 50602160
TargetTransient receptor potential cation channel subfamily M member 4(Homo sapiens)
Turning Point Therapeutics
Curated by ChEMBL
LigandPNGBDBM50602160(CHEMBL5179994)
Affinity DataEC50:  1.70E+3nM. Assay description: Agonist activity at human TRPM4 expressed in CHO-K1 cells assessed as increase in relative fluorescence unit by measuring membrane potential by FLIPR...
Ligand InfoPC cidPC sid
In DepthDetails PubMed
TargetTransient receptor potential cation channel subfamily M member 5(Homo sapiens (Human))
Turning Point Therapeutics
Curated by ChEMBL
LigandPNGBDBM50602160(CHEMBL5179994)
Affinity DataEC50:  316nM. Assay description: Agonist activity at human TRPM5 expressed in CHO-K1 cells assessed as increase in relative fluorescence unit measured for 2 mins by FLIPR based membr...
Ligand InfoPC cidPC sid
In DepthDetails PubMed