BDBM50605283 CHEMBL5188606
SMILES CCCCc1nc(cn1-c1ccc(Oc2ccc(Cl)cc2)cc1)C1CCN(CCCCc2c[nH]c3ccc(cc23)C#N)CC1
InChI Key InChIKey=LGHQJOINPWCINO-UHFFFAOYSA-N
Data  2 IC50
  Tab Delimited (TSV)   2D SDfile   Computed 3D by Vconf -m prep SDfile
Find this compound or compounds like it in BindingDB:
Activity Spreadsheet -- Enzyme Inhibition Constant Data from BindingDB
Found 2 hits for monomerid = 50605283
TargetSodium-dependent serotonin transporter(Homo sapiens (Human))
East China University Of Science And Technology
Curated by ChEMBL
LigandPNGBDBM50605283(CHEMBL5188606)
Affinity DataIC50:  66nM. Assay description: Inhibition of SERT (unknown origin) expressed in human HEK293 cells
Ligand InfoPC cidPC sid
In DepthDetails PubMed
TargetAdvanced glycosylation end product-specific receptor(Homo sapiens (Human))
East China University Of Science And Technology
Curated by ChEMBL
LigandPNGBDBM50605283(CHEMBL5188606)
Affinity DataIC50:  1.29E+4nM. Assay description: Inhibition of biotinylated human RAGE/amyloid beta interaction incubated for 120 mins by ELISA assay
Ligand InfoPC cidPC sid
In DepthDetails PubMed