BDBM50605310 CHEMBL5194592
SMILES CCCCc1nc(cn1-c1ccc(Oc2ccc(Cl)cc2)cc1)C1CCN(Cc2c[nH]c3ccc(cc23)C#N)CC1
InChI Key InChIKey=OWLMRISRKJELDA-UHFFFAOYSA-N
Data  2 IC50
  Tab Delimited (TSV)   2D SDfile   Computed 3D by Vconf -m prep SDfile
Find this compound or compounds like it in BindingDB:
Activity Spreadsheet -- Enzyme Inhibition Constant Data from BindingDB
Found 2 hits for monomerid = 50605310
TargetSodium-dependent serotonin transporter(Homo sapiens (Human))
East China University Of Science And Technology
Curated by ChEMBL
LigandPNGBDBM50605310(CHEMBL5194592)
Affinity DataIC50:  58nM. Assay description: Inhibition of SERT (unknown origin) expressed in human HEK293 cells
Ligand InfoPC cidPC sid
In DepthDetails PubMed
TargetAdvanced glycosylation end product-specific receptor(Homo sapiens (Human))
East China University Of Science And Technology
Curated by ChEMBL
LigandPNGBDBM50605310(CHEMBL5194592)
Affinity DataIC50:  4.04E+3nM. Assay description: Inhibition of biotinylated human RAGE/amyloid beta interaction incubated for 120 mins by ELISA assay
Ligand InfoPC cidPC sid
In DepthDetails PubMed