BDBM50605319 CHEMBL5171953
SMILES COc1cc(CN2CCc3c(cc(Cn4ccn(C)c4=N)cc3-c3ccc(F)cc3O)C2=O)cc(OC)c1
InChI Key InChIKey=FOTQAEWSOCFZJP-UHFFFAOYSA-N
Data  1 KI
  Tab Delimited (TSV)   2D SDfile   Computed 3D by Vconf -m prep SDfile
Find this compound or compounds like it in BindingDB:
Activity Spreadsheet -- Enzyme Inhibition Constant Data from BindingDB
Found 1 hit for monomerid = 50605319
TargetWD repeat-containing protein 5(Homo sapiens (Human))
Frederick National Laboratory For Cancer Research
Curated by ChEMBL
LigandPNGBDBM50605319(CHEMBL5171953)
Affinity DataKi:  0.0350nM. Assay description: Competitive binding affinity to N-terminal 6xHis-SUMO-tagged human WDR5 (22 to 334 residues) expressed in Escherichia coli BL21-Gold (DE3) cells asse...
Ligand InfoPC cidPC sid
In DepthDetails PubMed