BDBM50605331 CHEMBL5190578
SMILES CCn1cc(c(n1)C(F)(F)F)-c1cc(Cn2ccn(C)c2=N)cc2C(=O)N(Cc3cc(OC)cc(OC)c3)CCc12
InChI Key InChIKey=XQKWUJVZVJKWFS-UHFFFAOYSA-N
Data  1 KI
  Tab Delimited (TSV)   2D SDfile   Computed 3D by Vconf -m prep SDfile
Find this compound or compounds like it in BindingDB:
Activity Spreadsheet -- Enzyme Inhibition Constant Data from BindingDB
Found 1 hit for monomerid = 50605331
TargetWD repeat-containing protein 5(Homo sapiens (Human))
Frederick National Laboratory For Cancer Research
Curated by ChEMBL
LigandPNGBDBM50605331(CHEMBL5190578)
Affinity DataKi: <0.0200nM. Assay description: Competitive binding affinity to N-terminal 6xHis-SUMO-tagged human WDR5 (22 to 334 residues) expressed in Escherichia coli BL21-Gold (DE3) cells asse...
Ligand InfoPC cidPC sid
In DepthDetails PubMed