BDBM50605343 CHEMBL5190556
SMILES Cc1nccn1Cc1cc(-c2cn(C)nc2C(F)(F)F)c2CCN(Cc3cc(C)ccn3)C(=O)c2c1
InChI Key InChIKey=NQLMHXRNQWPCBA-UHFFFAOYSA-N
Data  1 KI
  Tab Delimited (TSV)   2D SDfile   Computed 3D by Vconf -m prep SDfile
Find this compound or compounds like it in BindingDB:
Activity Spreadsheet -- Enzyme Inhibition Constant Data from BindingDB
Found 1 hit for monomerid = 50605343
TargetWD repeat-containing protein 5(Homo sapiens (Human))
Frederick National Laboratory For Cancer Research
Curated by ChEMBL
LigandPNGBDBM50605343(CHEMBL5190556)
Affinity DataKi:  0.0200nM. Assay description: Competitive binding affinity to N-terminal 6xHis-SUMO-tagged human WDR5 (22 to 334 residues) expressed in Escherichia coli BL21-Gold (DE3) cells asse...
Ligand InfoPC cidPC sid
In DepthDetails PubMed