BDBM50605348 CHEMBL5183319
SMILES CCn1cc(c(n1)C(F)(F)F)-c1cc(Cn2ccnc2C)cc2C(=O)N(Cc3cc(OC)ccn3)CCc12
InChI Key InChIKey=GLOSEPKLMDGBBB-UHFFFAOYSA-N
Data  1 KI
  Tab Delimited (TSV)   2D SDfile   Computed 3D by Vconf -m prep SDfile
Find this compound or compounds like it in BindingDB:
Activity Spreadsheet -- Enzyme Inhibition Constant Data from BindingDB
Found 1 hit for monomerid = 50605348
TargetWD repeat-containing protein 5(Homo sapiens (Human))
Frederick National Laboratory For Cancer Research
Curated by ChEMBL
LigandPNGBDBM50605348(CHEMBL5183319)
Affinity DataKi: <0.0200nM. Assay description: Competitive binding affinity to N-terminal 6xHis-SUMO-tagged human WDR5 (22 to 334 residues) expressed in Escherichia coli BL21-Gold (DE3) cells asse...
Ligand InfoPC cidPC sid
In DepthDetails PubMed