BDBM50605353 CHEMBL5190717
SMILES CCn1cc(c(n1)C(F)(F)F)-c1cc(Cn2ccnc2C)cc2C(=O)N(CCc12)[C@@H](C1CC1)c1cc(C)ccn1
InChI Key InChIKey=URNMGEJXPZLHRK-MHZLTWQESA-N
Data  1 KI
PDB links: 1 PDB ID matches this monomer.
  Tab Delimited (TSV)   2D SDfile   Computed 3D by Vconf -m prep SDfile
Find this compound or compounds like it in BindingDB:
Activity Spreadsheet -- Enzyme Inhibition Constant Data from BindingDB
Found 1 hit for monomerid = 50605353
TargetWD repeat-containing protein 5(Homo sapiens (Human))
Frederick National Laboratory For Cancer Research
Curated by ChEMBL
LigandPNGBDBM50605353(CHEMBL5190717)
Affinity DataKi: <0.0200nM. Assay description: Competitive binding affinity to N-terminal 6xHis-SUMO-tagged human WDR5 (22 to 334 residues) expressed in Escherichia coli BL21-Gold (DE3) cells asse...
Ligand InfoPC cidPC sidPDB