BDBM50606726 CHEMBL5220911
SMILES CC(=O)N1CCN(CC1)c1cnc2ccc(cc2n1)-c1cnc(Cl)c(NS(=O)(=O)c2ccc(F)cc2)c1
InChI Key InChIKey=KGNNMSGRBVKSQP-UHFFFAOYSA-N
Data  5 IC50
  Tab Delimited (TSV)   2D SDfile   Computed 3D by Vconf -m prep SDfile
Find this compound or compounds like it in BindingDB:
Activity Spreadsheet -- Enzyme Inhibition Constant Data from BindingDB
Found 5 hits for monomerid = 50606726
TargetSerine/threonine-protein kinase mTOR(Homo sapiens (Human))
University Of Hradec Kralove
Curated by ChEMBL
LigandPNGBDBM50606726(CHEMBL5220911)
Affinity DataIC50:  3.10nM. Assay description: Inhibition of mTOR (unknown origin)
Ligand InfoPC cidPC sid
In DepthDetails PubMed
TargetPhosphatidylinositol 4,5-bisphosphate 3-kinase catalytic subunit alpha isoform(Homo sapiens (Human))
University Of Hradec Kralove
Curated by ChEMBL
LigandPNGBDBM50606726(CHEMBL5220911)
Affinity DataIC50: <0.495nM. Assay description: Inhibition of PI3Kalpha (unknown origin) by TR-FRET assay
Ligand InfoPC cidPC sid
In DepthDetails PubMed
TargetPhosphatidylinositol 4,5-bisphosphate 3-kinase catalytic subunit delta isoform(Homo sapiens (Human))
University Of Hradec Kralove
Curated by ChEMBL
LigandPNGBDBM50606726(CHEMBL5220911)
Affinity DataIC50: <0.495nM. Assay description: Inhibition of PI3Kdelta (unknown origin) by TR-FRET assay
Ligand InfoPC cidPC sid
In DepthDetails PubMed
TargetPhosphatidylinositol 4,5-bisphosphate 3-kinase catalytic subunit gamma isoform(Homo sapiens (Human))
University Of Hradec Kralove
Curated by ChEMBL
LigandPNGBDBM50606726(CHEMBL5220911)
Affinity DataIC50:  0.710nM. Assay description: Inhibition of PI3Kgamma (unknown origin) by TR-FRET assay
Ligand InfoPC cidPC sid
In DepthDetails PubMed
TargetPhosphatidylinositol 4,5-bisphosphate 3-kinase catalytic subunit beta isoform(Homo sapiens (Human))
University Of Hradec Kralove
Curated by ChEMBL
LigandPNGBDBM50606726(CHEMBL5220911)
Affinity DataIC50:  5.40nM. Assay description: Inhibition of PI3Kbeta (unknown origin) by TR-FRET assay
Ligand InfoPC cidPC sid
In DepthDetails PubMed