BDBM509089 S-[1-(2-{[2-({(2S)-2-Amino-4-[{(1R)-1-[1-benzyl-4-(2,5-difluorophenyl)-1H-pyrrol-2-yl]-2,2-dimethylpropyl}(glycoloyl)amino]butanoyl}amino)ethyl]amino}-2-oxoethyl)-2,5-dioxopyrrolidin-3-yl]-L-cysteine/trifluoroacetic acid (1:1)::US11071788, Example M1
SMILES CC(C)(C)[C@@H](N(CC[C@H](N)C(=O)NCCNC(=O)CN1C(=O)CC(SC[C@H](N)C(O)=O)C1=O)C(=O)CO)c1cc(cn1Cc1ccccc1)-c1cc(F)ccc1F
InChI Key InChIKey=JADQIQMCTFDINC-YDHGZPPESA-N
Data  1 IC50
  Tab Delimited (TSV)   2D SDfile   Computed 3D by Vconf -m prep SDfile
Find this compound or compounds like it in BindingDB:
Activity Spreadsheet -- Enzyme Inhibition Constant Data from BindingDB
Found 1 hit for monomerid = 509089
TargetKinesin-like protein KIF11(Homo sapiens (Human))
Bayer Pharma Aktiengesellschaft
US Patent
LigandPNGBDBM509089(S-[1-(2-{[2-({(2S)-2-Amino-4-[{(1R)-1-[1-benzyl-4-...)
Affinity DataIC50:  2.01nM. Assay description: The motor domain of the human kinesin spindle protein KSP/Eg5 (tebu-bio/Cytoskeleton Inc, No. 027EG01-XL) was incubated in a concentration of 10 nM w...
Ligand InfoKEGGPC cidPC sid
In DepthDetails US Patent