BDBM509090 4-[(2-{[2-({(2S)-2-Amino-4-[{(1R)-1-[1-benzyl-4-(2,5-difluorophenyl)-1H-pyrrol-2-yl]-2,2-dimethylpropyl}(glycoloyl)amino]butanoyl}amino)ethyl]amino}-2-oxoethyl)amino]-3-{[(2R)-2-amino-2-carboxyethyl]sulphanyl}-4-oxobutanoic acid/trifluoroacetic acid (1:1)::US11071788, Example M13::US11071788, Example M14::US11071788, Example M2
SMILES CC(C)(C)[C@@H](N(CC[C@H](N)C(=O)NCCNC(=O)CNC(=O)CC(SC[C@H](N)C(O)=O)C(O)=O)C(=O)CO)c1cc(cn1Cc1ccccc1)-c1cc(F)ccc1F
InChI Key InChIKey=LIQLXAIYSFIJOW-YDHGZPPESA-N
Data  3 IC50
  Tab Delimited (TSV)   2D SDfile   Computed 3D by Vconf -m prep SDfile
Find this compound or compounds like it in BindingDB:
Activity Spreadsheet -- Enzyme Inhibition Constant Data from BindingDB
Found 3 hits for monomerid = 509090
TargetKinesin-like protein KIF11(Homo sapiens (Human))
Bayer Pharma Aktiengesellschaft
US Patent
LigandPNGBDBM509090(4-[(2-{[2-({(2S)-2-Amino-4-[{(1R)-1-[1-benzyl-4-(2...)
Affinity DataIC50:  2.45nM. Assay description: The motor domain of the human kinesin spindle protein KSP/Eg5 (tebu-bio/Cytoskeleton Inc, No. 027EG01-XL) was incubated in a concentration of 10 nM w...
Ligand InfoKEGGPC cidPC sid
In DepthDetails US Patent
TargetKinesin-like protein KIF11(Homo sapiens (Human))
Bayer Pharma Aktiengesellschaft
US Patent
LigandPNGBDBM509090(4-[(2-{[2-({(2S)-2-Amino-4-[{(1R)-1-[1-benzyl-4-(2...)
Affinity DataIC50:  2.16nM. Assay description: The motor domain of the human kinesin spindle protein KSP/Eg5 (tebu-bio/Cytoskeleton Inc, No. 027EG01-XL) was incubated in a concentration of 10 nM w...
Ligand InfoKEGGPC cidPC sid
In DepthDetails US Patent
TargetKinesin-like protein KIF11(Homo sapiens (Human))
Bayer Pharma Aktiengesellschaft
US Patent
LigandPNGBDBM509090(4-[(2-{[2-({(2S)-2-Amino-4-[{(1R)-1-[1-benzyl-4-(2...)
Affinity DataIC50:  1.5nM. Assay description: The motor domain of the human kinesin spindle protein KSP/Eg5 (tebu-bio/Cytoskeleton Inc, No. 027EG01-XL) was incubated in a concentration of 10 nM w...
Ligand InfoKEGGPC cidPC sid
In DepthDetails US Patent