BDBM509106 N6 (N-{(2S)-2-Amino-4-[{(1R)-1-[1-benzyl-4-(2,5-difluorophenyl)-1H-pyrrol-2-yl]-2,2-dimethylpropyl}(glycoloyl)amino]butanoyl}-beta-alanyl)-L-lysine/trifluoroacetic acid (1:1)::US11071788, Example M19
SMILES CC(C)(C)[C@@H](N(CC[C@H](N)C(=O)NCCC(=O)NCCCC[C@H](N)C(O)=O)C(=O)CO)c1cc(cn1Cc1ccccc1)-c1cc(F)ccc1F
InChI Key InChIKey=ZSRUVMHANXZEPR-RRURFNPQSA-N
Data  1 IC50
  Tab Delimited (TSV)   2D SDfile   Computed 3D by Vconf -m prep SDfile
Find this compound or compounds like it in BindingDB:
Activity Spreadsheet -- Enzyme Inhibition Constant Data from BindingDB
Found 1 hit for monomerid = 509106
TargetKinesin-like protein KIF11(Homo sapiens (Human))
Bayer Pharma Aktiengesellschaft
US Patent
LigandPNGBDBM509106(N6 (N-{(2S)-2-Amino-4-[{(1R)-1-[1-benzyl-4-(2,5-di...)
Affinity DataIC50:  2.58nM. Assay description: The motor domain of the human kinesin spindle protein KSP/Eg5 (tebu-bio/Cytoskeleton Inc, No. 027EG01-XL) was incubated in a concentration of 10 nM w...
Ligand InfoKEGGPC cidPC sid
In DepthDetails US Patent