BDBM509111 N-{(2S)-2-Amino-4-[{(1R)-1-[1-benzyl-4-(2,5-difluorophenyl)-1H-pyrrol-2-yl]-2,2-dimethylpropyl}(glycoloyl)amino]butanoyl}-beta-alanyl-D-glutamic acid-trifluoroacetic acid::US11071788, Example M24
SMILES CC(C)(C)[C@@H](N(CC[C@H](N)C(=O)NCCC(=O)N[C@H](CCC(O)=O)C(O)=O)C(=O)CO)c1cc(cn1Cc1ccccc1)-c1cc(F)ccc1F
InChI Key InChIKey=IPQGHUWDCQTNBL-DWZXRANWSA-N
Data  1 IC50
  Tab Delimited (TSV)   2D SDfile   Computed 3D by Vconf -m prep SDfile
Find this compound or compounds like it in BindingDB:
Activity Spreadsheet -- Enzyme Inhibition Constant Data from BindingDB
Found 1 hit for monomerid = 509111
TargetKinesin-like protein KIF11(Homo sapiens (Human))
Bayer Pharma Aktiengesellschaft
US Patent
LigandPNGBDBM509111(N-{(2S)-2-Amino-4-[{(1R)-1-[1-benzyl-4-(2,5-difluo...)
Affinity DataIC50:  2.90nM. Assay description: The motor domain of the human kinesin spindle protein KSP/Eg5 (tebu-bio/Cytoskeleton Inc, No. 027EG01-XL) was incubated in a concentration of 10 nM w...
Ligand InfoKEGGPC cidPC sid
In DepthDetails US Patent