BDBM511077 2-(((2R,3S,4R,5R)-5-(6-amino-2-chloro-9H-purin-9-yl)-3-ethynyl-3,4-dihydroxytetrahydrofuran-2-yl)methoxy)-2-(4-(2-oxopiperidin-1-yl)benzyl)malonic acid::US11078228, Example 10
SMILES Nc1nc(Cl)nc2n(cnc12)[C@@H]1O[C@H](COC(Cc2ccc(cc2)N2CCCCC2=O)(C(O)=O)C(O)=O)[C@](O)(C#C)[C@H]1O
InChI Key InChIKey=IYGQBVNFUKBANX-AZTDZYQASA-N
Data  1 IC50
  Tab Delimited (TSV)   2D SDfile   Computed 3D by Vconf -m prep SDfile
Find this compound or compounds like it in BindingDB:
Activity Spreadsheet -- Enzyme Inhibition Constant Data from BindingDB
Found 1 hit for monomerid = 511077
Target5'-nucleotidase(Homo sapiens (Human))
Calithera Biosciences
US Patent
LigandPNGBDBM511077(2-(((2R,3S,4R,5R)-5-(6-amino-2-chloro-9H-purin-9-y...)
Affinity DataIC50:  0.260nM. Assay description: For measurements of soluble CD73 enzyme activity, recombinant CD73 was obtained from R&D Systems, Cat. No. 5795-EN-010. Serial dilutions of test comp...
Ligand InfoPC cidPC sid
In DepthDetails US Patent