BDBM512277 US11084821, Example 7::cis-4-(4-Phenylpyrimidin-2- yl)hexahydropyrrolo[3,4-b][1,4]oxazine- 6(2H)-carbonitrile
SMILES N#CN1C[C@@H]2OCCN([C@@H]2C1)c1nccc(n1)-c1ccccc1
InChI Key InChIKey=VPYYGJSVILHEFW-CVEARBPZSA-N
Data  1 IC50
  Tab Delimited (TSV)   2D SDfile   Computed 3D by Vconf -m prep SDfile
Find this compound or compounds like it in BindingDB:
Activity Spreadsheet -- Enzyme Inhibition Constant Data from BindingDB
Found 1 hit for monomerid = 512277
TargetUbiquitin carboxyl-terminal hydrolase 30(Homo sapiens (Human))
Mission Therapeutics
US Patent
LigandPNGBDBM512277(US11084821, Example 7 | cis-4-(4-Phenylpyrimidin-2...)
Affinity DataIC50:  550nM. Assay description: Dilution plates were prepared at 21 times the final concentration (2100 μM for a final concentration of 100 μM) in 50% DMSO in a 96-well po...
Ligand InfoPC cidPC sid
In DepthDetails US Patent