BDBM512285 3-(Methyl(5-phenylpyridin-2-yl)amino)pyrrolidine-1-carbonitrile::US11084821, Example 14
SMILES CN(C1CCN(C1)C#N)c1ccc(cn1)-c1ccccc1
InChI Key InChIKey=JBKBOQDILPUBTP-UHFFFAOYSA-N
Data  1 IC50
  Tab Delimited (TSV)   2D SDfile   Computed 3D by Vconf -m prep SDfile
Find this compound or compounds like it in BindingDB:
Activity Spreadsheet -- Enzyme Inhibition Constant Data from BindingDB
Found 1 hit for monomerid = 512285
TargetUbiquitin carboxyl-terminal hydrolase 30(Homo sapiens (Human))
Mission Therapeutics
US Patent
LigandPNGBDBM512285(3-(Methyl(5-phenylpyridin-2-yl)amino)pyrrolidine-1...)
Affinity DataIC50:  5.50E+3nM. Assay description: Dilution plates were prepared at 21 times the final concentration (2100 μM for a final concentration of 100 μM) in 50% DMSO in a 96-well po...
Ligand InfoPC cidPC sid
In DepthDetails US Patent