BDBM512290 US11084821, Example 19::cis-4-(2'-Cyano-[3,4'-bipyridin]-6-yl)hexahydropyrrolo[3,4-b][1,4]oxazine-6(2H)-carbonitrile
SMILES N#CN1C[C@@H]2OCCN([C@@H]2C1)c1ccc(cn1)-c1ccnc(c1)C#N
InChI Key InChIKey=YEHKUJCPSAWOMO-SJORKVTESA-N
Data  1 IC50
  Tab Delimited (TSV)   2D SDfile   Computed 3D by Vconf -m prep SDfile
Find this compound or compounds like it in BindingDB:
Activity Spreadsheet -- Enzyme Inhibition Constant Data from BindingDB
Found 1 hit for monomerid = 512290
TargetUbiquitin carboxyl-terminal hydrolase 30(Homo sapiens (Human))
Mission Therapeutics
US Patent
LigandPNGBDBM512290(US11084821, Example 19 | cis-4-(2'-Cyano-[3,4'-bip...)
Affinity DataIC50:  5.5nM. Assay description: Dilution plates were prepared at 21 times the final concentration (2100 μM for a final concentration of 100 μM) in 50% DMSO in a 96-well po...
Ligand InfoPC cidPC sid
In DepthDetails US Patent