BDBM512364 Preparation of N3-(2,6-dimethylphenyl)-N6-(1,2,3,4-tetrahydroisoquinoline-7-yl)-1H-pyrazolo[3,4-d]pyrimidine-3,6-diamine::US11084824, Example 19
SMILES Cc1cccc(C)c1Nc1n[nH]c2nc(Nc3ccc4CCNCc4c3)ncc12
InChI Key InChIKey=IZTDIATUHNDTOK-UHFFFAOYSA-N
Data  1 IC50
  Tab Delimited (TSV)   2D SDfile   Computed 3D by Vconf -m prep SDfile
Find this compound or compounds like it in BindingDB:
Activity Spreadsheet -- Enzyme Inhibition Constant Data from BindingDB
Found 1 hit for monomerid = 512364
TargetTyrosine-protein kinase BTK(Homo sapiens (Human))
Korea Research Institute of Chemical Technology
US Patent
LigandPNGBDBM512364(Preparation of N3-(2,6-dimethylphenyl)-N6-(1,2,3,4...)
Affinity DataIC50:  0.300nM. Assay description: BTK enzyme evaluation with each compound of examples of the invention was performed by using BTK enzyme inhibition diagnosis kit (Cisbio, Codolet, Fr...
Ligand InfoPC cidPC sid
In DepthDetails US Patent