BDBM512367 US11084824, Example 22
SMILES Cc1cccc(C)c1Nc1nn(C)c2nc(Nc3ccc4CCN(Cc4c3)C(=O)CO)ncc12
InChI Key InChIKey=ZPUUFJAPWKGWHM-UHFFFAOYSA-N
Data  1 IC50
  Tab Delimited (TSV)   2D SDfile   Computed 3D by Vconf -m prep SDfile
Find this compound or compounds like it in BindingDB:
Activity Spreadsheet -- Enzyme Inhibition Constant Data from BindingDB
Found 1 hit for monomerid = 512367
TargetTyrosine-protein kinase BTK(Homo sapiens (Human))
Korea Research Institute of Chemical Technology
US Patent
LigandPNGBDBM512367(US11084824, Example 22)
Affinity DataIC50:  0.400nM. Assay description: BTK enzyme evaluation with each compound of examples of the invention was performed by using BTK enzyme inhibition diagnosis kit (Cisbio, Codolet, Fr...
Ligand InfoPC cidPC sid
In DepthDetails US Patent