BDBM514 4-hydroxy-3,8-diphenyl-2H-chromen-2-one::Cancer Chemotherapy National Service Center (CCNSC) compound 251150::NSC 251150
SMILES Oc1c(-c2ccccc2)c(=O)oc2c(cccc12)-c1ccccc1
InChI Key InChIKey=KHZAWTVDPWVVBY-UHFFFAOYSA-N
Data  4 IC50
  Tab Delimited (TSV)   2D SDfile   Computed 3D by Vconf -m prep SDfile
Find this compound or compounds like it in BindingDB:
Activity Spreadsheet -- Enzyme Inhibition Constant Data from BindingDB
Found 4 hits for monomerid = 514
TargetDimer of Gag-Pol polyprotein [489-587](Human immunodeficiency virus type 1)
National Institutes of Health
LigandPNGBDBM514(4-hydroxy-3,8-diphenyl-2H-chromen-2-one | Cancer C...)
Affinity DataIC50:  1.30E+4nMpH: 6.5 T: 2°C. Assay description: Sensitivity of HIV-1 protease activity to protease inhibitors was determined by a peptide substrate cleavage assay. Protease products were analyzed o...
In DepthDetails ArticlePubMed
TargetGag-Pol polyprotein [489-587](Human immunodeficiency virus type 1)
National Cancer Institute-Bethesda
Curated by ChEMBL
LigandPNGBDBM514(4-hydroxy-3,8-diphenyl-2H-chromen-2-one | Cancer C...)
Affinity DataIC50:  1.30E+4nM. Assay description: Inhibitory activity against HIV-1 protease
In DepthDetails ArticlePubMed
TargetIntegrase(Human immunodeficiency virus 1)
National Cancer Institute-Bethesda
Curated by ChEMBL
LigandPNGBDBM514(4-hydroxy-3,8-diphenyl-2H-chromen-2-one | Cancer C...)
Affinity DataIC50: >1.00E+5nM. Assay description: Inhibitory activity against HIV-1 integrase
In DepthDetails ArticlePubMed
TargetIntegrase(Human immunodeficiency virus 1)
National Cancer Institute-Bethesda
Curated by ChEMBL
LigandPNGBDBM514(4-hydroxy-3,8-diphenyl-2H-chromen-2-one | Cancer C...)
Affinity DataIC50: >1.00E+5nM. Assay description: Inhibitory activity against HIV-1 integrase
In DepthDetails ArticlePubMed