BDBM515820 US11053225, Compound 101::US11053225, Compound 196
SMILES OCCn1cc(cn1)-c1cnc(Nc2cccc(Cl)c2)nc1Nc1ccc2CCNCc2c1
InChI Key InChIKey=STGJRXCRLCYESQ-UHFFFAOYSA-N
Data  6 IC50
  Tab Delimited (TSV)   2D SDfile   Computed 3D by Vconf -m prep SDfile
Find this compound or compounds like it in BindingDB:
Activity Spreadsheet -- Enzyme Inhibition Constant Data from BindingDB
Found 6 hits for monomerid = 515820
TargetTyrosine-protein kinase receptor TYRO3(Homo sapiens (Human))
Korea Research Institute of Chemical Technology
US Patent
LigandPNGBDBM515820(US11053225, Compound 101 | US11053225, Compound 19...)
Affinity DataIC50:  0.0120nM. Assay description: For evaluation of inhibitory activities of the compounds according to the present invention on Tyro 3, Axl, and Mer, the following test was carried o...
Ligand InfoPC cidPC sid
In DepthDetails US Patent
TargetTyrosine-protein kinase receptor UFO(Homo sapiens (Human))
Korea Research Institute of Chemical Technology
US Patent
LigandPNGBDBM515820(US11053225, Compound 101 | US11053225, Compound 19...)
Affinity DataIC50:  730nM. Assay description: For evaluation of inhibitory activities of the compounds according to the present invention on Tyro 3, Axl, and Mer, the following test was carried o...
Ligand InfoPC cidPC sid
In DepthDetails US Patent
TargetTyrosine-protein kinase Mer(Homo sapiens (Human))
Korea Research Institute of Chemical Technology
US Patent
LigandPNGBDBM515820(US11053225, Compound 101 | US11053225, Compound 19...)
Affinity DataIC50:  54nM. Assay description: For evaluation of inhibitory activities of the compounds according to the present invention on Tyro 3, Axl, and Mer, the following test was carried o...
Ligand InfoPC cidPC sid
In DepthDetails US Patent
TargetTyrosine-protein kinase receptor TYRO3(Homo sapiens (Human))
Korea Research Institute of Chemical Technology
US Patent
LigandPNGBDBM515820(US11053225, Compound 101 | US11053225, Compound 19...)
Affinity DataIC50:  0.600nM. Assay description: For evaluation of inhibitory activities of the compounds according to the present invention on Tyro 3, Axl, and Mer, the following test was carried o...
Ligand InfoPC cidPC sid
In DepthDetails US Patent
TargetTyrosine-protein kinase receptor UFO(Homo sapiens (Human))
Korea Research Institute of Chemical Technology
US Patent
LigandPNGBDBM515820(US11053225, Compound 101 | US11053225, Compound 19...)
Affinity DataIC50:  3.65E+3nM. Assay description: For evaluation of inhibitory activities of the compounds according to the present invention on Tyro 3, Axl, and Mer, the following test was carried o...
Ligand InfoPC cidPC sid
In DepthDetails US Patent
TargetTyrosine-protein kinase Mer(Homo sapiens (Human))
Korea Research Institute of Chemical Technology
US Patent
LigandPNGBDBM515820(US11053225, Compound 101 | US11053225, Compound 19...)
Affinity DataIC50:  26nM. Assay description: For evaluation of inhibitory activities of the compounds according to the present invention on Tyro 3, Axl, and Mer, the following test was carried o...
Ligand InfoPC cidPC sid
In DepthDetails US Patent