BDBM515830 US11053225, Compound 131
SMILES Fc1cc(F)cc(Nc2ncc(-c3cnn(c3)C3CCNCC3)c(Nc3ccc4CCNCc4c3)n2)c1
InChI Key InChIKey=YULMPWFRJYANBE-UHFFFAOYSA-N
Data  3 IC50
  Tab Delimited (TSV)   2D SDfile   Computed 3D by Vconf -m prep SDfile
Find this compound or compounds like it in BindingDB:
Activity Spreadsheet -- Enzyme Inhibition Constant Data from BindingDB
Found 3 hits for monomerid = 515830
TargetTyrosine-protein kinase receptor TYRO3(Homo sapiens (Human))
Korea Research Institute of Chemical Technology
US Patent
LigandPNGBDBM515830(US11053225, Compound 131)
Affinity DataIC50:  0.160nM. Assay description: For evaluation of inhibitory activities of the compounds according to the present invention on Tyro 3, Axl, and Mer, the following test was carried o...
Ligand InfoPC cidPC sid
In DepthDetails US Patent
TargetTyrosine-protein kinase Mer(Homo sapiens (Human))
Korea Research Institute of Chemical Technology
US Patent
LigandPNGBDBM515830(US11053225, Compound 131)
Affinity DataIC50: >1.00E+4nM. Assay description: For evaluation of inhibitory activities of the compounds according to the present invention on Tyro 3, Axl, and Mer, the following test was carried o...
Ligand InfoPC cidPC sid
In DepthDetails US Patent
TargetTyrosine-protein kinase receptor UFO(Homo sapiens (Human))
Korea Research Institute of Chemical Technology
US Patent
LigandPNGBDBM515830(US11053225, Compound 131)
Affinity DataIC50:  41nM. Assay description: For evaluation of inhibitory activities of the compounds according to the present invention on Tyro 3, Axl, and Mer, the following test was carried o...
Ligand InfoPC cidPC sid
In DepthDetails US Patent