BDBM515838 US11053225, Compound 139
SMILES Cn1cc(cn1)-c1cnc(Nc2cc(cc(c2)C(F)(F)F)C(F)(F)F)nc1Nc1ccc2CCN(Cc2c1)C(=O)C(F)(F)F
InChI Key InChIKey=IGIFKKVOZTZYSP-UHFFFAOYSA-N
Data  3 IC50
  Tab Delimited (TSV)   2D SDfile   Computed 3D by Vconf -m prep SDfile
Find this compound or compounds like it in BindingDB:
Activity Spreadsheet -- Enzyme Inhibition Constant Data from BindingDB
Found 3 hits for monomerid = 515838
TargetTyrosine-protein kinase receptor TYRO3(Homo sapiens (Human))
Korea Research Institute of Chemical Technology
US Patent
LigandPNGBDBM515838(US11053225, Compound 139)
Affinity DataIC50:  0.00600nM. Assay description: For evaluation of inhibitory activities of the compounds according to the present invention on Tyro 3, Axl, and Mer, the following test was carried o...
Ligand InfoPC cidPC sid
In DepthDetails US Patent
TargetTyrosine-protein kinase Mer(Homo sapiens (Human))
Korea Research Institute of Chemical Technology
US Patent
LigandPNGBDBM515838(US11053225, Compound 139)
Affinity DataIC50:  8.00E+3nM. Assay description: For evaluation of inhibitory activities of the compounds according to the present invention on Tyro 3, Axl, and Mer, the following test was carried o...
Ligand InfoPC cidPC sid
In DepthDetails US Patent
TargetTyrosine-protein kinase receptor UFO(Homo sapiens (Human))
Korea Research Institute of Chemical Technology
US Patent
LigandPNGBDBM515838(US11053225, Compound 139)
Affinity DataIC50: >1.00E+4nM. Assay description: For evaluation of inhibitory activities of the compounds according to the present invention on Tyro 3, Axl, and Mer, the following test was carried o...
Ligand InfoPC cidPC sid
In DepthDetails US Patent