BDBM515857 US11053225, Compound 159
SMILES Cc1ccc(F)cc1Nc1ncc(-c2cnn(C)c2)c(Nc2ccc3CCNCc3c2)n1
InChI Key InChIKey=UBYNKDNUYDOWAR-UHFFFAOYSA-N
Data  3 IC50
  Tab Delimited (TSV)   2D SDfile   Computed 3D by Vconf -m prep SDfile
Find this compound or compounds like it in BindingDB:
Activity Spreadsheet -- Enzyme Inhibition Constant Data from BindingDB
Found 3 hits for monomerid = 515857
TargetTyrosine-protein kinase receptor TYRO3(Homo sapiens (Human))
Korea Research Institute of Chemical Technology
US Patent
LigandPNGBDBM515857(US11053225, Compound 159)
Affinity DataIC50:  0.170nM. Assay description: For evaluation of inhibitory activities of the compounds according to the present invention on Tyro 3, Axl, and Mer, the following test was carried o...
Ligand InfoPC cidPC sid
In DepthDetails US Patent
TargetTyrosine-protein kinase Mer(Homo sapiens (Human))
Korea Research Institute of Chemical Technology
US Patent
LigandPNGBDBM515857(US11053225, Compound 159)
Affinity DataIC50:  230nM. Assay description: For evaluation of inhibitory activities of the compounds according to the present invention on Tyro 3, Axl, and Mer, the following test was carried o...
Ligand InfoPC cidPC sid
In DepthDetails US Patent
TargetTyrosine-protein kinase receptor UFO(Homo sapiens (Human))
Korea Research Institute of Chemical Technology
US Patent
LigandPNGBDBM515857(US11053225, Compound 159)
Affinity DataIC50:  2.35E+3nM. Assay description: For evaluation of inhibitory activities of the compounds according to the present invention on Tyro 3, Axl, and Mer, the following test was carried o...
Ligand InfoPC cidPC sid
In DepthDetails US Patent