BDBM518449 US11124509, Compound 8
SMILES Cn1ccc(n1)-c1nc(CNc2ccc(F)cc2)[nH]c1-c1ccc2ncnn2c1
InChI Key InChIKey=ODYOZDHCXJDYKH-UHFFFAOYSA-N
Data  1 IC50
  Tab Delimited (TSV)   2D SDfile   Computed 3D by Vconf -m prep SDfile
Find this compound or compounds like it in BindingDB:
Activity Spreadsheet -- Enzyme Inhibition Constant Data from BindingDB
Found 1 hit for monomerid = 518449
TargetTGF-beta receptor type-1(Homo sapiens (Human))
Clavius Pharmaceuticals
US Patent
LigandPNGBDBM518449(US11124509, Compound 8)
Affinity DataIC50:  811nM. Assay description: Exemplified compounds were screened in 1% DMSO (final concentration) by 3-fold serial dilutions from 10,000 nM to 0.316 nM to produce an IC50 or at s...
Ligand InfoPC cidPC sid
In DepthDetails US Patent