BDBM518452 US11124509, Compound 17
SMILES CC(C)n1ccc(n1)-c1nc([nH]c1-c1ccc2ncnn2c1)-c1ccc(cc1)C(N)=O
InChI Key InChIKey=IIGMZUKJIPFREC-UHFFFAOYSA-N
Data  1 IC50
  Tab Delimited (TSV)   2D SDfile   Computed 3D by Vconf -m prep SDfile
Find this compound or compounds like it in BindingDB:
Activity Spreadsheet -- Enzyme Inhibition Constant Data from BindingDB
Found 1 hit for monomerid = 518452
TargetTGF-beta receptor type-1(Homo sapiens (Human))
Clavius Pharmaceuticals
US Patent
LigandPNGBDBM518452(US11124509, Compound 17)
Affinity DataIC50: <1.00E+3nM. Assay description: Exemplified compounds were screened in 1% DMSO (final concentration) by 3-fold serial dilutions from 10,000 nM to 0.316 nM to produce an IC50 or at s...
Ligand InfoPC cidPC sid
In DepthDetails US Patent