BDBM518492 US11124509, Compound 65
SMILES CCNC(=O)c1ccc(cc1)-c1nc(-c2ccn(C)n2)c([nH]1)-c1ccc2ncsc2c1
InChI Key InChIKey=CPRZGKBKIPGYTK-UHFFFAOYSA-N
Data  1 IC50
  Tab Delimited (TSV)   2D SDfile   Computed 3D by Vconf -m prep SDfile
Find this compound or compounds like it in BindingDB:
Activity Spreadsheet -- Enzyme Inhibition Constant Data from BindingDB
Found 1 hit for monomerid = 518492
TargetTGF-beta receptor type-1(Homo sapiens (Human))
Clavius Pharmaceuticals
US Patent
LigandPNGBDBM518492(US11124509, Compound 65)
Affinity DataIC50:  46.2nM. Assay description: Exemplified compounds were screened in 1% DMSO (final concentration) by 3-fold serial dilutions from 10,000 nM to 0.316 nM to produce an IC50 or at s...
Ligand InfoPC cidPC sid
In DepthDetails US Patent