BDBM520296 N-[(3S)-6′-Chloro-5-(cyclobutylmethyl)spiro[2,4-dihydro-1,5-benzoxazepine-3,1′-tetralin]-7-yl]sulfonylcyclopentanecarboxamide::US11130769, Ex. No. 13
SMILES Clc1ccc2c(CCC[C@]22COc3ccc(cc3N(CC3CCC3)C2)S(=O)(=O)NC(=O)C2CCCC2)c1
InChI Key InChIKey=CIMDTDCVXWRNFC-LJAQVGFWSA-N
Data  1 KI
  Tab Delimited (TSV)   2D SDfile   Computed 3D by Vconf -m prep SDfile
Find this compound or compounds like it in BindingDB:
Activity Spreadsheet -- Enzyme Inhibition Constant Data from BindingDB
Found 1 hit for monomerid = 520296
TargetInduced myeloid leukemia cell differentiation protein Mcl-1(Homo sapiens (Human))
Prelude Therapeutics
US Patent
LigandPNGBDBM520296(N-[(3S)-6′-Chloro-5-(cyclobutylmethyl)spiro[...)
Affinity DataKi:  22nM. Assay description: The assay was carried out in black half-area 96-well NBS plate (Corning), containing 15 nM of MCL-1 (BPS Bioscience), 5 nM of FITC-Bim and 3-fold ser...
Ligand InfoPC cidPC sid
In DepthDetails US Patent