BDBM520302 2-Pyridin-4-yl-N-[(3S)-6′-chloro-5-(cyclobutylmethyl)spiro[2,4-dihydro-1,5-benzoxazepine-3,1′-tetralin]-7-yl]sulfonyl-acetamide::US11130769, Ex. No. 19
SMILES Clc1ccc2c(CCC[C@]22COc3ccc(cc3N(CC3CCC3)C2)S(=O)(=O)NC(=O)Cc2ccncc2)c1
InChI Key InChIKey=HUCNVJCAPNNKQR-PMERELPUSA-N
Data  1 KI
  Tab Delimited (TSV)   2D SDfile   Computed 3D by Vconf -m prep SDfile
Find this compound or compounds like it in BindingDB:
Activity Spreadsheet -- Enzyme Inhibition Constant Data from BindingDB
Found 1 hit for monomerid = 520302
TargetInduced myeloid leukemia cell differentiation protein Mcl-1(Homo sapiens (Human))
Prelude Therapeutics
US Patent
LigandPNGBDBM520302(2-Pyridin-4-yl-N-[(3S)-6′-chloro-5-(cyclobut...)
Affinity DataKi:  9.30nM. Assay description: The assay was carried out in black half-area 96-well NBS plate (Corning), containing 15 nM of MCL-1 (BPS Bioscience), 5 nM of FITC-Bim and 3-fold ser...
Ligand InfoPC cidPC sid
In DepthDetails US Patent