BDBM520440 US11130769, Ex. No. 139::[(3R,6R,7R,8E,22S)-6′-Chloro-11,12,12-trimethyl-13,15,15-trioxo-spiro[20-oxa-15-thia-1,11,14-triazatetracyclo[14.7.2.03,6.019,24]pentacosa-8,16,18,24-tetraene-22,1′-tetralin]-7-yl] N,N-dimethylcarbamate
SMILES CN(C)C(=O)O[C@@H]1\C=C\CN(C)C2(CCC2)C(=O)NS(=O)(=O)c2ccc3OC[C@]4(CCCc5cc(Cl)ccc45)CN(C[C@@H]4CC[C@@H]14)c3c2
InChI Key InChIKey=YCONZGKUMPRVGM-GJQGVSRBSA-N
Data  1 KI
  Tab Delimited (TSV)   2D SDfile   Computed 3D by Vconf -m prep SDfile
Find this compound or compounds like it in BindingDB:
Activity Spreadsheet -- Enzyme Inhibition Constant Data from BindingDB
Found 1 hit for monomerid = 520440
TargetInduced myeloid leukemia cell differentiation protein Mcl-1(Homo sapiens (Human))
Prelude Therapeutics
US Patent
LigandPNGBDBM520440(US11130769, Ex. No. 139 | [(3R,6R,7R,8E,22S)-6R...)
Affinity DataKi: <100nM. Assay description: The assay was carried out in black half-area 96-well NBS plate (Corning), containing 15 nM of MCL-1 (BPS Bioscience), 5 nM of FITC-Bim and 3-fold ser...
Ligand InfoPC cidPC sid
In DepthDetails US Patent