BDBM520526 US11130769, Ex. No. 225::[(3R,6R,7S,8E,22S)-6′-Chloro-11-ethyl-12,12-dimethyl-13,15,15-trioxo-spiro[20-oxa-15-thia-1,11,14-triazatetracyclo[14.7.2.03,6.019,24]pentacosa-8,16,18,24-tetraene-22,1′-tetralin]-7-yl] 4-(2-methoxyethyl)piperazine-1-carboxylate
SMILES CCN1C\C=C\[C@H](OC(=O)N2CCN(CCOC)CC2)[C@@H]2CC[C@H]2CN2C[C@@]3(CCCc4cc(Cl)ccc34)COc3ccc(cc23)S(=O)(=O)NC(=O)C1(C)C
InChI Key InChIKey=ZIVBLIBKCJCPPV-DIMISJINSA-N
Data  1 KI
  Tab Delimited (TSV)   2D SDfile   Computed 3D by Vconf -m prep SDfile
Find this compound or compounds like it in BindingDB:
Activity Spreadsheet -- Enzyme Inhibition Constant Data from BindingDB
Found 1 hit for monomerid = 520526
TargetInduced myeloid leukemia cell differentiation protein Mcl-1(Homo sapiens (Human))
Prelude Therapeutics
US Patent
LigandPNGBDBM520526(US11130769, Ex. No. 225 | [(3R,6R,7S,8E,22S)-6R...)
Affinity DataKi: <100nM. Assay description: The assay was carried out in black half-area 96-well NBS plate (Corning), containing 15 nM of MCL-1 (BPS Bioscience), 5 nM of FITC-Bim and 3-fold ser...
Ligand InfoPC cidPC sid
In DepthDetails US Patent