BDBM521614 US11149054, Compound 5131
SMILES C[C@H](CCC1(O)CCC(CC1)OC(F)F)[C@H]1CC[C@H]2[C@@H]3CC[C@H]4C[C@@](O)(CC[C@]4(C)[C@H]3CC[C@]12C)C(F)(F)F
InChI Key InChIKey=NFQATBQBCXJLCA-XBSDHDGASA-N
Data  2 EC50
  Tab Delimited (TSV)   2D SDfile   Computed 3D by Vconf -m prep SDfile
Find this compound or compounds like it in BindingDB:
Activity Spreadsheet -- Enzyme Inhibition Constant Data from BindingDB
Found 2 hits for monomerid = 521614
TargetGlutamate receptor ionotropic, NMDA 2B(Homo sapiens (Human))
Sage Therapeutics
US Patent
LigandPNGBDBM521614(US11149054, Compound 5131)
Affinity DataEC50: >1.00E+4nM. Assay description: The whole-cell patch-clamp technique was used to investigate the effects of positive allosteric modulating activity of test compounds on GlunN1/GluN2...
Ligand InfoPC cidPC sid
In DepthDetails US Patent
TargetGlutamate receptor ionotropic, NMDA 2A(Homo sapiens (Human))
Sage Therapeutics
US Patent
LigandPNGBDBM521614(US11149054, Compound 5131)
Affinity DataEC50:  33.6nM. Assay description: The whole-cell patch-clamp technique was used to investigate the effects of positive allosteric modulating activity of test compounds on GlunN1/GluN2...
Ligand InfoPC cidPC sid
In DepthDetails US Patent