BDBM521739 US11149066, Compound 24
SMILES CC[C@H](C)[C@@H]1NC(=O)[C@H](Cc2ccc3ccccc3c2)NC(=O)CSC[C@H](NC(=O)[C@@H](NC(=O)[C@H](Cc2c[nH]c3ccccc23)NC(=O)[C@@H](CCCCN)NC(=O)[C@@H](NC(=O)[C@H](Cc2c[nH]c3ccccc23)NC(=O)[C@H](CC(N)=O)NC(=O)[C@H](CCCNC(N)=N)NC(=O)CNC(=O)[C@H](CO)NC1=O)C(C)C)C(C)C)C(N)=O
InChI Key
Data  1 Kd
  Tab Delimited (TSV)   2D SDfile   Computed 3D by Vconf -m prep SDfile
Find this compound or compounds like it in BindingDB:
Activity Spreadsheet -- Enzyme Inhibition Constant Data from BindingDB
Found 1 hit for monomerid = 521739
TargetThrombospondin-1(Homo sapiens)
Daiichi Sankyo
US Patent
LigandPNGBDBM521739(US11149066, Compound 24)
Affinity DataKd:  0.120nM. Assay description: As referred to herein, the TSP1 inhibitory activity refers to the activity to inhibit one or more effects of TSP1, including angiostatic effect. The ...
Ligand InfoPC cidPC sid
In DepthDetails US Patent