BDBM522148 US11161815, Example 4
SMILES [O-][N+](=O)c1ccc(Cl)nc1S(=O)(=O)Cc1ccccc1
InChI Key InChIKey=RJCQTYZMPADGRQ-UHFFFAOYSA-N
Data  2 IC50
  Tab Delimited (TSV)   2D SDfile   Computed 3D by Vconf -m prep SDfile
Find this compound or compounds like it in BindingDB:
Activity Spreadsheet -- Enzyme Inhibition Constant Data from BindingDB
Found 2 hits for monomerid = 522148
TargetGlutathione reductase, mitochondrial(Homo sapiens (Human))
Oblique Therapeutics
US Patent
LigandPNGBDBM522148(US11161815, Example 4)
Affinity DataIC50:  1.81E+4nM. Assay description: Small molecule inhibition of recombinant thioredoxin reductase 1 (TrxR1) and gluthathione reductase (GR) was examined in 96-well plate format. 30 nM ...
Ligand InfoPC cidPC sid
In DepthDetails US Patent
TargetThioredoxin reductase 1, cytoplasmic(Homo sapiens (Human))
Oblique Therapeutics
US Patent
LigandPNGBDBM522148(US11161815, Example 4)
Affinity DataIC50:  39.2nM. Assay description: Small molecule inhibition of recombinant thioredoxin reductase 1 (TrxR1) and gluthathione reductase (GR) was examined in 96-well plate format. 30 nM ...
Ligand InfoPC cidPC sid
In DepthDetails US Patent