BDBM524189 US11168069, Example 2
SMILES COc1ccc(c(n1)S(=O)(=O)C1CCN(CC1)C(C)=O)[N+]([O-])=O
InChI Key InChIKey=UBGNOWMAPRWLCS-UHFFFAOYSA-N
Data  2 IC50
  Tab Delimited (TSV)   2D SDfile   Computed 3D by Vconf -m prep SDfile
Find this compound or compounds like it in BindingDB:
Activity Spreadsheet -- Enzyme Inhibition Constant Data from BindingDB
Found 2 hits for monomerid = 524189
TargetGlutathione reductase, mitochondrial(Homo sapiens (Human))
Oblique Therapeutics
US Patent
LigandPNGBDBM524189(US11168069, Example 2)
Affinity DataIC50: >1.00E+5nM. Assay description: Small molecule inhibition of recombinant thioredoxin reductase 1 (TrxR1) and gluthathione reductase (GR) was examined in 96-well plate format. 30 nM ...
Ligand InfoPC cidPC sid
In DepthDetails US Patent
TargetThioredoxin reductase 1, cytoplasmic(Homo sapiens (Human))
Oblique Therapeutics
US Patent
LigandPNGBDBM524189(US11168069, Example 2)
Affinity DataIC50:  391nM. Assay description: Small molecule inhibition of recombinant thioredoxin reductase 1 (TrxR1) and gluthathione reductase (GR) was examined in 96-well plate format. 30 nM ...
Ligand InfoPC cidPC sid
In DepthDetails US Patent