BDBM524248 Preparation of 2-(azepan-1-yl)-4-(chloromethyl)thiazole::US11168080, Compound A-18
SMILES Cc1cc(C(=O)Nc2ccc(cc2)C(O)=O)n(Cc2csc(n2)N2CCCCCC2)c1
InChI Key InChIKey=RMHNQFQWTVNNAL-UHFFFAOYSA-N
Data  1 IC50
  Tab Delimited (TSV)   2D SDfile   Computed 3D by Vconf -m prep SDfile
Find this compound or compounds like it in BindingDB:
Activity Spreadsheet -- Enzyme Inhibition Constant Data from BindingDB
Found 1 hit for monomerid = 524248
TargetDynamin-1-like protein(Human)
Mitobridge
US Patent
LigandPNGBDBM524248(Preparation of 2-(azepan-1-yl)-4-(chloromethyl)thi...)
Affinity DataIC50:  3.40E+3nM. Assay description: The GTPase activity of Drp1 was assayed using a colorimetric assay similar to as described previously by Leonard M. et al. “Robust colorimetric assay...
Ligand InfoPC cidPC sid
In DepthDetails US Patent