BDBM524250 Preparation of Ethyl 2-(2-methylpiperidin-1-yl)thiazole-4-carboxylate::US11168080, Compound A-20
SMILES CC1CCCCN1c1nc(Cn2cc(C)cc2C(=O)Nc2ccc(cc2)C(O)=O)cs1
InChI Key InChIKey=NNHJZCMICMBLCH-UHFFFAOYSA-N
Data  1 IC50
  Tab Delimited (TSV)   2D SDfile   Computed 3D by Vconf -m prep SDfile
Find this compound or compounds like it in BindingDB:
Activity Spreadsheet -- Enzyme Inhibition Constant Data from BindingDB
Found 1 hit for monomerid = 524250
TargetDynamin-1-like protein(Human)
Mitobridge
US Patent
LigandPNGBDBM524250(Preparation of Ethyl 2-(2-methylpiperidin-1-yl)thi...)
Affinity DataIC50:  3.90E+3nM. Assay description: The GTPase activity of Drp1 was assayed using a colorimetric assay similar to as described previously by Leonard M. et al. “Robust colorimetric assay...
Ligand InfoPC cidPC sid
In DepthDetails US Patent