BDBM524272 Preparation of 4-methyl-N-(2-oxoindolin-5-yl)-1-((2-(piperidin-1-yl)thiazol-4-yl)methyl)-1H-pyrrole-2-carboxamide::US11168080, Compound A-41
SMILES Cc1cc(C(=O)Nc2ccc3NC(=O)Cc3c2)n(Cc2csc(n2)N2CCCCC2)c1
InChI Key InChIKey=WVKMAMNESGRBFQ-UHFFFAOYSA-N
Data  1 IC50
  Tab Delimited (TSV)   2D SDfile   Computed 3D by Vconf -m prep SDfile
Find this compound or compounds like it in BindingDB:
Activity Spreadsheet -- Enzyme Inhibition Constant Data from BindingDB
Found 1 hit for monomerid = 524272
TargetDynamin-1-like protein(Human)
Mitobridge
US Patent
LigandPNGBDBM524272(Preparation of 4-methyl-N-(2-oxoindolin-5-yl)-1-((...)
Affinity DataIC50:  4.20E+3nM. Assay description: The GTPase activity of Drp1 was assayed using a colorimetric assay similar to as described previously by Leonard M. et al. “Robust colorimetric assay...
Ligand InfoPC cidPC sid
In DepthDetails US Patent