BDBM526974 US11186587, Example 2
SMILES COc1ccccc1C(Cn1c2sc(c(C)c2c(=O)n(C2CC(F)(F)C2)c1=O)-c1ncco1)OC1CCOCC1
InChI Key InChIKey=JISRCQQMMJBCCZ-UHFFFAOYSA-N
Data  1 IC50
  Tab Delimited (TSV)   2D SDfile   Computed 3D by Vconf -m prep SDfile
Find this compound or compounds like it in BindingDB:
Activity Spreadsheet -- Enzyme Inhibition Constant Data from BindingDB
Found 1 hit for monomerid = 526974
TargetAcetyl-CoA carboxylase 1(Homo sapiens (Human))
Nanjing Sanhome Pharmaceutical
US Patent
LigandPNGBDBM526974(US11186587, Example 2)
Affinity DataIC50:  8.70nM. Assay description: 4.5 μL of 2.2×ACC1 enzyme (2 nM) working solution was added to a 384-well plate; and then 0.5 μL of different concentrations of compound we...
Ligand InfoPC cidPC sid
In DepthDetails US Patent